{"text_format":"1","workbook":"xlsx","n_sheets":5,"sheets":["precision","bias","Tables, data","control chart","Amendments"],"not_rendered":{"charts":1,"images":0,"macros":0,"external_links":3,"defined_names":76,"comments":3,"pivot_tables":0},"unopened":[],"bounds":{"document_bytes":16777216,"sheet_cells":100000,"rows_first":2000,"rows_last":500,"rows_between":2000,"halvings":0,"cell_chars":16384,"cell_head_chars":4096},"cells_cut":0,"cells_raw":0,"read":"whole","date_system":"1900"}

{"sheet":"precision","index":0,"n_rows":50,"n_cols":18,"rows_kept":50,"cut":false,"hidden":false,"merged":[]}
["Uncertainty of Measurement: precision calculations"]
[null,null,null,null,null,null,null,null,null,null,null,null,null,"C.  Range calculations"]
["Determinand, method  ",null,null,null,null,null,null,null,null,null,null,null,null,null,null,null,"batch","rel.mean"]
["range  ",null,null,null,null,null,null,null,null,null,null,null,null,null,"max","min","mean","Rj, rel"]
["liimit of quantification  ",null,{"$f":"C4","v":0},null,null,null,"coverage factor, k =",2,null,null,null,null,null,1,null,null,{"$f":"IFERROR(AVERAGE(O5:P5),\"\")","v":""},{"$f":"IF(O5=0,\"\",ABS(O5-P5)/Q5)","v":""}]
[null,null,null,null,null,null,null,null,null,null,null,null,null,2,null,null,{"$f":"IFERROR(AVERAGE(O6:P6),\"\")","v":""},{"$f":"IF(O6=0,\"\",ABS(O6-P6)/Q6)","v":""}]
["A.  Precision estimate using a matrix standard",null,null,null,null,null,null,"AQC standard, nominal value",null,{"$f":"C4","v":0},null,null,null,3,null,null,"",""]
["Individual sources of","symbol","units","conc'n","st.dev.","no.","uncert-ainty","rel.uncert-ainty","expanded. factor =",{"$f":"H5","v":2},null,null,null,4,null,null,"",""]
["uncertainty",null,null,"cj","sj","nM","uj","uj,rel","U","Urel",null,null,null,5,null,null,"",""]
["AQC standard in matrix","sRw",{"$f":"C4","v":0},null,null,null,{"$f":"E10","v":0},{"$f":"IFERROR(G10/D10,\"\")","v":""},{"$f":"G10*$J$8","v":0},{"$f":"IFERROR(H10*$J$8,\"\")","v":""},null,null,null,6,null,null,"",""]
["mean range from chart","Rj, rel",{"$f":"$C$4","v":0},{"$f":"R45","v":{"$error":"#DIV/0!"}},null,null,{"$f":"IFERROR(H11*D11,\"\")","v":""},{"$f":"IFERROR(D11/VLOOKUP(F11,'Tables, data'!$W$10:$X$18,2),\"\")","v":""},{"$f":"IFERROR(H11*$J$8*D11,\"\")","v":""},{"$f":"IFERROR(H11*$J$8,\"\")","v":""},null,null,null,7,null,null,"",""]
["Combined ","uRw","= √∑u2",null,null,null,{"$f":"SQRT(SUMSQ(G10:G11))","v":0},{"$f":"SQRT(SUMSQ(H10:H11))","v":0},{"$f":"SQRT(SUMSQ(I10:I11))","v":0},{"$f":"SQRT(SUMSQ(J10:J11))","v":0},null,null,null,8,null,null,"",""]
[null,null,null,null,null,null,null,null,null,null,null,null,null,9,null,null,"",""]
[null,null,null,null,null,null,null,null,null,null,null,null,null,10,null,null,"",""]
[null,null,null,null,null,null,null,null,null,null,null,null,null,11,null,null,"",""]
[null,null,null,null,null,null,null,null,null,null,null,null,null,12,null,null,"",""]
["B.  Precision estimate using a synthetic standard",null,null,null,null,null,null,"AQC standard, nominal value",null,{"$f":"C4","v":0},null,null,null,13,null,null,"",""]
["Individual sources of","symbol","units","conc'n","st.dev.","no.","uncertainty","rel.uncert-ainty","expanded. factor =",{"$f":"H5","v":2},null,null,null,14,null,null,"",""]
["uncertainty",null,null,"cj","sj","nM","uj","uj,rel","U","Urel",null,null,null,15,null,null,"",""]
["AQC standard","sRw",{"$f":"$C$4","v":0},null,null,null,{"$f":"E20","v":0},{"$f":"IFERROR(G20/D20,\"\")","v":""},{"$f":"G20*$J$8","v":0},{"$f":"IFERROR(H20*$J$8,\"\")","v":""},null,null,null,16,null,null,{"$f":"IFERROR(AVERAGE(O20:P20),\"\")","v":""},""]
{"$rows_left_out":31}
{"sheet":"bias","index":1,"n_rows":166,"n_cols":51,"rows_kept":166,"cut":false,"hidden":false,"merged":[[110,4,110,5]]}
["Uncertainty of Measurement: bias calculations"]
[null,null,null,null,null,null,null,null,null,null,null,null,null,null,null,null,"M. Concentration of reference materials"]
["Determinand, method  ",null,null,null,null,null,null,null,null,null,null,null,null,null,null,null,null,"units","nominal conc'n","st.dev","no.","relative unc'ty"]
["range  ",null,null,null,null,null,null,null,null,null,null,null,null,null,null,null,null,null,"Cref","uCref","nM","uCref, rel"]
["liimit of quantification  ",null,{"$f":"C4","v":0},null,null,null,"coverage factor, k =",2,null,null,null,null,null,null,null,null,"Traceable standard","mg/L",null,null,null,{"$f":"IFERROR(T5/S5,\"\")","v":""}]
[null,null,null,null,null,null,null,null,null,null,null,null,null,null,null,null,"Reference material","mg/L",null,null,null,""]
["Note: the within laboratory reproducibility needs to be combined with the sources of uncertainty in the reference value.",null,null,null,null,null,null,null,null,null,null,null,null,null,null,null,"AQC sample for PT","mg/L",null,null,null,""]
["This is commonly estimated separately, eg. from a control chart as a coefficient of variation = standard deviation ÷ mean",null,null,null,null,null,null,null,null,null,null,null,null,null,null,null,"Control chart standard","mg/L",null,null,null,""]
[null,null,null,null,null,null,null,null,null,null,null,null,null,null,null,null,"PT scheme distribution","mg/L",null,null,null,""]
["D1.  Bias uncertainty using a single traceable standard or CRM ",null,null,null,null,null,null,null,null,null,"coverage factor, k =",{"$f":"H5","v":2},null,null,null,null,"Recovery test","mg/L",null,null,null,"",null,null,null,null,"D3.  pH (absolute) Bias uncertainty using a single traceable standard or CRM "]
[null,null," conc'n"," st.dev =  sRw","no.","relative unc'ty",null,"bias","relative bias","coeff. variation","rel. bias uncertainty","rel. expanded uncertainty",null,null,null,null,"Other",null,null,null,null,"",null,null,null,null,null,null," conc'n"," st.dev =  sRw","no."," unc'ty ref mat","relative unc'ty",null,"bias",null,"bias uncertainty"," expanded uncertainty"]
["Reference standard",null,"c","uCref","nM","uCref, rel",null,"b","brel","CV,b=uRw,rel","ub,rel","Ub,rel",null,null,null,null,null,null,null,null,null,null,null,null,null,null,"Reference standard",null,"c","Sb","nM","uCref","uCref, rel",null,"b",null,"ub","Ub"]
["Reference standard","Cref",null,null,null,{"$f":"D13/C13","v":{"$error":"#DIV/0!"}},null,null,null,null,null,null,null,null,null,null,null,null,null,null,null,null,null,null,null,null,"Reference standard","Cref",null,null,null,{"$f":"AG13*AC13/100","v":0},null,"%"]
["Measured value, mean","c",null,null,null,{"$f":"D14/C14","v":{"$error":"#DIV/0!"}},null,{"$f":"C14-C13","v":0},{"$f":"H14/C13","v":{"$error":"#DIV/0!"}},{"$f":"D14/C14","v":{"$error":"#DIV/0!"}},{"$f":"SQRT(I14^2+J14^2/E14+F13^2)","v":{"$error":"#DIV/0!"}},{"$f":"K14*L10","v":{"$error":"#DIV/0!"}},null,null,null,null,null,null,null,null,null,null,null,null,null,null,"Measured value, mean","c",null,null,null,null,null,null,{"$f":"AC14-AC13","v":0},null,{"$f":"SQRT(AI14^2+(AD14/SQRT(AE14))^2+AF13^2)","v":{"$error":"#DIV/0!"}},{"$f":"AK14*L10","v":{"$error":"#DIV/0!"}}]
["Within lab. reproducibility","uRw,rel","= CV",null,null,null,null,null,null,null,{"$f":"F14","v":{"$error":"#DIV/0!"}}]
["Combined uncertainty","uc,rel",null,null,null,null,null,null,null,null,{"$f":"SQRT(SUMSQ(K14:K15))","v":{"$error":"#DIV/0!"}},{"$f":"K16*L10","v":{"$error":"#DIV/0!"}}]
[null,null,null,null,null,null,null,null,null,null,null,"(ISO11352, section B.1.3)",null,null,null,null,null,null,null,null,null,null,null,null,null,null,null,null,null,null,null,null,null,null,null,null,null,"(ISO11352, section B.1.3)"]
["D2.  Bias uncertainty using multiple traceable standards or CRMs ",null,null,null,null,null,null,null,null,null,null,null,null,null,null,null,null,null,null,null,null,null,null,null,null,null,"D4. pH (absolute) Bias uncertainty using multiple traceable standards or CRMs "]
["Overall TS or CRM",null," conc'n"," st.dev =  sRw","no.","relative unc'ty",null,"bias","relative bias","coeff. variation","rel. bias uncertainty","rel. expanded uncertainty",null,null,null,null,null,null,null,null,null,null,null,null,null,null,"Overall TS or CRM",null," conc'n"," st.dev =  sRw","no."," unc'ty ref mat","relative unc'ty",null,"bias",null,"bias uncertainty"," expanded uncertainty"]
["Reference standard",null,"c","uCref","nM","uCref, rel",null,"b","brel","CV,b=uRw,rel","ub,rel","Ub,rel",null,null,null,null,null,null,null,null,null,null,null,null,null,null,"Reference standard",null,"c","Sb","nM","uCref","uCref, rel",null,"b",null,"ub","Ub"]
{"$rows_left_out":147}
{"sheet":"Tables, data","index":2,"n_rows":107,"n_cols":24,"rows_kept":107,"cut":false,"hidden":false,"merged":[]}
["Tables and data",null,null,null,null,null,"coverage factor, k =",2]
[]
["L.  Control Chart data",null,null,null,null,"C'.  Range calculations",null,null,null,null,null,"F.  Recovery calculations",null,null,null,null,"J. Replicates calculations",null,null,null,null,null,"Q. Range chart factor"]
[null,"units","measured conc'n","bias",null,null,null,null,"batch","relative range",null,"Nominal","units","measured conc'n","relative bias",null,null,null,"mass",null,null,null,"mean range"]
["Nominal conc'n (Cref)",null,"c","b = Di",null,null,"max","min","mean","Rj, rel",null,"conc'n (Cref)",100,"η","bi,rel",null,null,null,"uV,i,rep,rel",null,null,null,"no. replicates"]
[1,"µg/ml",null,{"$f":"IF(ISBLANK(C6)=FALSE,C6-$B$5,\"\")","v":""},null,1,null,null,{"$f":"IFERROR(AVERAGE(G6:H6),\"\")","v":""},{"$f":"IF(G6=0,\"\",ABS(G6-H6)/I6)","v":""},null,1,"%",null,{"$f":"IF(ISBLANK(N6)=FALSE,(N6-$N$26)/$N$26,\"\")","v":""},null,1,null,null,null,null,null,"d2",{"$f":"VLOOKUP(X5,W10:X18,2)","v":{"$error":"#N/A"}}]
[2,{"$f":"B6","v":"µg/ml"},null,"",null,2,null,null,{"$f":"IFERROR(AVERAGE(G7:H7),\"\")","v":""},{"$f":"IF(G7=0,\"\",ABS(G7-H7)/I7)","v":""},null,2,{"$f":"M6","v":"%"},null,"",null,2,null,null,null,null,null,"sr,range = ur,range",{"$f":"X4/X6","v":{"$error":"#N/A"}}]
[3,"µg/ml",null,"",null,3,null,null,"","",null,3,"%",null,"",null,3,null,null,null,null,null,"No. of ","factor"]
[4,"µg/ml",null,"",null,4,null,null,"","",null,4,"%",null,"",null,4,null,null,null,null,null,"replicates","d2"]
[5,"µg/ml",null,"",null,5,null,null,"","",null,5,"%",null,"",null,5,null,null,null,null,null,2,1.1279999999999999]
[6,"µg/ml",null,"",null,6,null,null,"","",null,6,"%",null,"",null,6,null,null,null,null,null,3,1.6930000000000001]
[7,"µg/ml",null,"",null,7,null,null,"","",null,7,{"$f":"M11","v":"%"},null,"",null,7,null,null,null,null,null,4,2.0590000000000002]
[8,"µg/ml",null,"",null,8,null,null,"","",null,8,"%",null,"",null,8,null,null,null,null,null,5,2.3260000000000001]
[9,"µg/ml",null,"",null,9,null,null,"","",null,9,"%",null,"",null,9,null,null,null,null,null,6,2.5339999999999998]
[10,"µg/ml",null,"",null,10,null,null,"","",null,10,"%",null,"",null,10,null,null,null,null,null,7,2.7040000000000002]
[11,"µg/ml",null,"",null,11,null,null,"","",null,11,"%",null,"",null,11,null,null,null,null,null,8,2.847]
[12,"µg/ml",null,{"$f":"IF(ISBLANK(C17)=FALSE,C17-$B$5,\"\")","v":""},null,12,null,null,"","",null,12,{"$f":"M16","v":"%"},null,"",null,12,null,null,null,null,null,9,2.97]
[13,"µg/ml",null,"",null,13,null,null,"","",null,13,"%",null,"",null,13,null,null,null,null,null,10,3.0779999999999998]
[14,"µg/ml",null,"",null,14,null,null,"","",null,14,"%",null,"",null,14,null,null,null,null,null,null,"(ISO11352, table A.1)"]
[15,"µg/ml",null,"",null,15,null,null,"","",null,15,"%",null,"",null,15]
{"$rows_left_out":88}
{"sheet":"control chart","index":3,"n_rows":69,"n_cols":25,"rows_kept":69,"cut":false,"hidden":false,"merged":[]}
["Control chart",null,null,null,"(data copied from block L in 'Tables, data')"]
[]
[null,null,"AQC ",null,null,"Limits",null,null,null,null,null,null,null,null,null,null,null,null,null,null,"limits"]
["point","QC std","failure",null,null,"AL","WL","mean","WL","AL",null,null,null,null,null,null,null,null,null,null,"AL","WL","centre","WL","AL"]
[1,{"$f":"IF('Tables, data'!C6>0,'Tables, data'!C6,\"\")","v":""},{"$f":"IFERROR(IF(ISBLANK(B5)=TRUE,\"\",IF(ABS(B5-$H$5)>($H$5-$F$5),\"action\",IF(ABS(B5-$H$5)>($H$5-$G$5),\"warning\",\"\"))),\"\")","v":""},null,null,{"$f":"$Q$32-$Q$36","v":0},{"$f":"$Q$32-$Q$35","v":0},{"$f":"$Q$32","v":0},{"$f":"$Q$32+$Q$35","v":0},{"$f":"$Q$32+$Q$36","v":0},null,null,null,null,null,null,null,null,null,null,{"$f":"F5","v":0},{"$f":"G5","v":0},{"$f":"H5","v":0},{"$f":"I5","v":0},{"$f":"J5","v":0}]
[2,{"$f":"IF('Tables, data'!C7>0,'Tables, data'!C7,\"\")","v":""},"",null,null,null,null,null,null,null,null,null,null,null,null,null,null,null,null,null,{"$f":"U5","v":0},{"$f":"V5","v":0},{"$f":"W5","v":0},{"$f":"X5","v":0},{"$f":"Y5","v":0}]
[3,{"$f":"IF('Tables, data'!C8>0,'Tables, data'!C8,\"\")","v":""},"",null,null,null,null,null,null,null,null,null,null,null,null,null,null,null,null,null,{"$f":"U6","v":0},0,0,0,0]
[4,{"$f":"IF('Tables, data'!C9>0,'Tables, data'!C9,\"\")","v":""},"",null,null,null,null,null,null,null,null,null,null,null,null,null,null,null,null,null,0,0,0,0,0]
[5,{"$f":"IF('Tables, data'!C10>0,'Tables, data'!C10,\"\")","v":""},"",null,null,null,null,null,null,null,null,null,null,null,null,null,null,null,null,null,0,0,0,0,0]
[6,{"$f":"IF('Tables, data'!C11>0,'Tables, data'!C11,\"\")","v":""},"",null,null,null,null,null,null,null,null,null,null,null,null,null,null,null,null,null,0,0,0,0,0]
[7,{"$f":"IF('Tables, data'!C12>0,'Tables, data'!C12,\"\")","v":""},"",null,null,null,null,null,null,null,null,null,null,null,null,null,null,null,null,null,0,0,0,0,0]
[8,{"$f":"IF('Tables, data'!C13>0,'Tables, data'!C13,\"\")","v":""},"",null,null,null,null,null,null,null,null,null,null,null,null,null,null,null,null,null,{"$f":"U11","v":0},0,0,0,0]
[9,{"$f":"IF('Tables, data'!C14>0,'Tables, data'!C14,\"\")","v":""},"",null,null,null,null,null,null,null,null,null,null,null,null,null,null,null,null,null,{"$f":"U12","v":0},0,0,0,0]
[10,{"$f":"IF('Tables, data'!C15>0,'Tables, data'!C15,\"\")","v":""},"",null,null,null,null,null,null,null,null,null,null,null,null,null,null,null,null,null,{"$f":"U13","v":0},0,0,0,0]
[11,{"$f":"IF('Tables, data'!C16>0,'Tables, data'!C16,\"\")","v":""},"",null,null,null,null,null,null,null,null,null,null,null,null,null,null,null,null,null,{"$f":"U14","v":0},0,0,0,0]
[12,{"$f":"IF('Tables, data'!C17>0,'Tables, data'!C17,\"\")","v":""},"",null,null,null,null,null,null,null,null,null,null,null,null,null,null,null,null,null,{"$f":"U15","v":0},0,0,0,0]
[13,{"$f":"IF('Tables, data'!C18>0,'Tables, data'!C18,\"\")","v":""},"",null,null,null,null,null,null,null,null,null,null,null,null,null,null,null,null,null,{"$f":"U16","v":0},0,0,0,0]
[14,{"$f":"IF('Tables, data'!C19>0,'Tables, data'!C19,\"\")","v":""},"",null,null,null,null,null,null,null,null,null,null,null,null,null,null,null,null,null,{"$f":"U17","v":0},0,0,0,0]
[15,{"$f":"IF('Tables, data'!C20>0,'Tables, data'!C20,\"\")","v":""},"",null,null,null,null,null,null,null,null,null,null,null,null,null,null,null,null,null,{"$f":"U18","v":0},0,0,0,0]
[16,{"$f":"IF('Tables, data'!C21>0,'Tables, data'!C21,\"\")","v":""},"",null,null,null,null,null,null,null,null,null,null,null,null,null,null,null,null,null,{"$f":"U19","v":0},0,0,0,0]
{"$rows_left_out":50}
{"sheet":"Amendments","index":4,"n_rows":14,"n_cols":2,"rows_kept":14,"cut":false,"hidden":false,"merged":[]}
[null,"Amendments V1.2 "]
[null,"The following have been updated in the calculations file on the bias tab:"]
[null,"the RMS calculation changed from using relative bias to mean bias (this corrects the relative values to absolute);"]
[null,"the Di error, test numbers 1-6 updated from ‘=mean bias’ to ‘mean bias/assigned value’;"]
[null,"formula for test numbers 7 – 20 corrected for relative uncertainty assigned value column as #REF! error was being displayed, formula from test 1-6 copied down;"]
[null,"removed ‘rel’ from Cv=uRw;"]
[null,"separate robust mean multiplier added above table G2 and formula amended from I83 to Y83 accordingly"]
[null,"D2 - new blocks added to accommodate up to 6 different CRMs, correct calculation as per ISO (relative terms, %)"]
[null,"D3 – new block added in based on D1 (for pH in absolute terms)"]
[null,"D4 - new blocks added to accommodate up to 6 different CRMs, correct calculation as per ISO (absolute terms for pH)"]
[null,"G2 – block is the same (use of PT for pH bias estimate) as original but I’ve added a title is that it can be referenced in the BB (there wasn’t a title/reference block name)"]
[null,"- F – calculation changed in cells I47 to I76, updated to nominal 100% for recovery estimates of bias"]
[null,"- summary table - traceable standard, additional column with drop down added to specify which has been used (cell M148)"]
[null,"all data removed to leave a blank template"]